Build Failure TransformException, ProcessException and DexException

musedeveloper

#1

Installed unity and trying to build for Android using direction following http://developer.choosemuse.com/sdk/unity/getting-started.

at the end build fails with following message. Any one seen this?

com.android.build.api.transform.TransformException: com.android.ide.common.process.ProcessException: java.util.concurrent.ExecutionException: com.android.dex.DexException: Multiple dex files define Lcom/choosemuse/example/unity/LibmuseUnityAndroid$1; See the Console for details.